{"text_format":"1","workbook":"xlsx","n_sheets":10,"sheets":["Kalkulator","koszyki","raport RTT","Arkusz2","krzywa","Instrukcja","Manual","Kalkulator Depozytów","Transakcje_PCCP","Tabela"],"not_rendered":{"charts":0,"images":3,"macros":1,"external_links":0,"defined_names":4,"comments":0,"pivot_tables":0},"unopened":[],"bounds":{"document_bytes":16777216,"sheet_cells":100000,"rows_first":2000,"rows_last":500,"rows_between":2000,"halvings":0,"cell_chars":16384,"cell_head_chars":4096},"cells_cut":0,"cells_raw":0,"read":"whole","date_system":"1900"}

{"sheet":"Kalkulator","index":0,"n_rows":88,"n_cols":47,"rows_kept":88,"cut":false,"hidden":true,"merged":[]}
["Podaj Datę",null,"Typ kontraktu",null,null,"typ"]
[{"$f":"'Kalkulator Depozytów'!F12","v":"00:00:00"},null,"GAS_BASE"]
[null,null,null,null,null,null,null,null,null,null,null,null,null,null,null,null,null,null,null,null,null,null,"ile < 0","ile > 0","minimalne >0","maksymalne <0"]
[null,null,null,null,null,null,null,null,null,null,null,null,null,null,null,null,null,null,null,null,null,null,{"$f":"COUNTIF(U8:U23,\"<0\")","v":16},{"$f":"COUNTIF(V8:V23,\"<0\")","v":16},{"$f":"SMALL(U8:U23,W4+1)","v":{"$error":"#NUM!"}},{"$f":"SMALL(V8:V23,X4)","v":-1892}]
[null,null,null,null,null,null,null,null,null,null,null,null,null,null,null,"Suma Depozytów",null,null,null,null,null,null,null,null,null,null,null,"różnica","ile dodać?"]
[null,null,null,null,null,null,null,null,null,null,null,null,null,null,null,{"$f":"SUM(P8:P29)","v":0},{"$f":"SUM(Q8:Q29)*'Kalkulator Depozytów'!F14","v":{"$error":"#N/A"}},null,null,null,"miejsce na date początkową","miejsce na datę końcową",null,null,{"$f":"VLOOKUP(Y4,U8:X23,4,0)","v":{"$error":"#NUM!"}},{"$f":"VLOOKUP(Z4,V8:X23,3,0)","v":16},null,{"$f":"Y6-Z6+1","v":{"$error":"#NUM!"}}]
["Początek","Koniec","Nominał","Wolumen Kupna","ŚWKK","Wolumen Sprzedaży","ŚWWS","Kurs Rozliczeniowy","Współczynnik Ryzyka",null,"Dni","godziny czas letni/zimowy","Liczba dni roboczych","Liczba dnia świątecznych",null,"Depozyt uzupełniający","Depozyt wstępny",null,null,null,"2025-10-01","2025-12-31",null,null,null,10,null,null,null,null,null,"data koniec",null,null,null,null,"czy święto",null,null,null,null,"sum jeżeli"]
["2023-10-27","2023-10-27",{"$f":"IF($C$2=\"GAS_BASE\",(B8-A8+1)*koszyki!$A$14+J8,IF($C$2=\"OFFPEAK\",M8*koszyki!$A$14+(N8)*24+J8,IF($C$2=\"BASE5\",M8*koszyki!$A$14+J8,IF($C$2=\"PEAK7\",(B8-A8+1)*koszyki!$A$14,M8*koszyki!$A$14))))","v":24},{"$f":"'Kalkulator Depozytów'!M13","v":0},{"$f":"'Kalkulator Depozytów'!N13","v":0},{"$f":"'Kalkulator Depozytów'!O13","v":0},{"$f":"'Kalkulator Depozytów'!P13","v":0},{"$f":"'Kalkulator Depozytów'!Q13","v":0},{"$f":"ROUND(AVERAGE(INDIRECT(\"krzywa!C\"&MATCH(A8-$A$2,krzywa!A:A,0)&\":C\"&MATCH(B8-$A$2,krzywa!A:A,0),TRUE)),4)","v":{"$error":"#N/A"}},null,{"$f":"IF(-($A$2-B8)<364,-($A$2-B8),365)","v":365},"GAS_BASE",{"$f":"NETWORKDAYS(A8,B8,koszyki!$M$20:$M$89)","v":1},{"$f":"B8-A8+1- NETWORKDAYS(A8,B8,koszyki!$M$20:$M$89)","v":0},null,{"$f":"(C8*D8)*(H8-E8)-(C8*F8)*(H8-G8)","v":0},{"$f":"-C8*ABS(D8-F8)*H8*I8","v":{"$error":"#N/A"}},null,null,null,{"$f":"Y8-$U$7","v":-4567},{"$f":"Y8-$V$7","v":-4658},null,1,"2013-03-31",-1,null,null,null,null,null,{"$f":"B8","v":"2023-10-27"},{"$f":"AF8-1","v":"2023-10-26"},{"$f":"AG8-1","v":"2023-10-25"},{"$f":"AH8-1","v":"2023-10-24"},null,{"$f":"NETWORKDAYS(AF8,AF8,koszyki!$M$20:$M$89)","v":1},{"$f":"NETWORKDAYS(AG8,AG8,koszyki!$M$20:$M$89)","v":1},{"$f":"NETWORKDAYS(AH8,AH8,koszyki!$M$20:$M$89)","v":1},{"$f":"NETWORKDAYS(AI8,AI8,koszyki!$M$20:$M$89)","v":1},null,{"$f":"SUM(AK8)","v":1},{"$f":"SUM(AK8:AL8)","v":2},{"$f":"SUM(AK8:AM8)","v":3},{"$f":"SUM(AK8:AN8)","v":4},null,{"$f":"COUNTIF(AP8:AS8,\"=0\")","v":0}]
["2023-10-28","2023-10-28",{"$f":"IF($C$2=\"GAS_BASE\",(B9-A9+1)*koszyki!$A$14+J9,IF($C$2=\"OFFPEAK\",M9*koszyki!$A$14+(N9)*24+J9,IF($C$2=\"BASE5\",M9*koszyki!$A$14+J9,IF($C$2=\"PEAK7\",(B9-A9+1)*koszyki!$A$14,M9*koszyki!$A$14))))","v":24},{"$f":"'Kalkulator Depozytów'!M14","v":0},{"$f":"'Kalkulator Depozytów'!N14","v":0},{"$f":"'Kalkulator Depozytów'!O14","v":0},{"$f":"'Kalkulator Depozytów'!P14","v":0},{"$f":"'Kalkulator Depozytów'!Q14","v":0},{"$f":"ROUND(AVERAGE(INDIRECT(\"krzywa!C\"&MATCH(A9-$A$2,krzywa!A:A,0)&\":C\"&MATCH(B9-$A$2,krzywa!A:A,0),TRUE)),4)","v":{"$error":"#N/A"}},null,{"$f":"IF(-($A$2-B9)<364,-($A$2-B9),365)","v":365},"GAS_BASE",{"$f":"NETWORKDAYS(A9,B9,koszyki!$M$20:$M$89)","v":0},{"$f":"B9-A9+1- NETWORKDAYS(A9,B9,koszyki!$M$20:$M$89)","v":1},null,{"$f":"(C9*D9)*(H9-E9)-(C9*F9)*(H9-G9)","v":0},{"$f":"-C9*ABS(D9-F9)*H9*I9","v":{"$error":"#N/A"}},null,null,null,{"$f":"Y9-$U$7","v":-4357},{"$f":"Y9-$V$7","v":-4448},null,2,"2013-10-27",1,null,null,null,null,null,{"$f":"B9","v":"2023-10-28"},{"$f":"AF9-1","v":"2023-10-27"},"2023-10-26","2023-10-25",null,{"$f":"NETWORKDAYS(AF9,AF9,koszyki!$M$20:$M$89)","v":0},{"$f":"NETWORKDAYS(AG9,AG9,koszyki!$M$20:$M$89)","v":1},{"$f":"NETWORKDAYS(AH9,AH9,koszyki!$M$20:$M$89)","v":1},{"$f":"NETWORKDAYS(AI9,AI9,koszyki!$M$20:$M$89)","v":1},null,{"$f":"SUM(AK9)","v":0},{"$f":"SUM(AK9:AL9)","v":1},{"$f":"SUM(AK9:AM9)","v":2},{"$f":"SUM(AK9:AN9)","v":3},null,{"$f":"COUNTIF(AP9:AS9,\"=0\")","v":1}]
["2023-10-29","2023-10-29",{"$f":"IF($C$2=\"GAS_BASE\",(B10-A10+1)*koszyki!$A$14+J10,IF($C$2=\"OFFPEAK\",M10*koszyki!$A$14+(N10)*24+J10,IF($C$2=\"BASE5\",M10*koszyki!$A$14+J10,IF($C$2=\"PEAK7\",(B10-A10+1)*koszyki!$A$14,M10*koszyki!$A$14))))","v":24},{"$f":"'Kalkulator Depozytów'!M15","v":0},{"$f":"'Kalkulator Depozytów'!N15","v":0},{"$f":"'Kalkulator Depozytów'!O15","v":0},{"$f":"'Kalkulator Depozytów'!P15","v":0},{"$f":"'Kalkulator Depozytów'!Q15","v":0},{"$f":"ROUND(AVERAGE(INDIRECT(\"krzywa!C\"&MATCH(A10-$A$2,krzywa!A:A,0)&\":C\"&MATCH(B10-$A$2,krzywa!A:A,0),TRUE)),4)","v":{"$error":"#N/A"}},null,365,"GAS_BASE",{"$f":"NETWORKDAYS(A10,B10,koszyki!$M$20:$M$89)","v":0},{"$f":"B10-A10+1- NETWORKDAYS(A10,B10,koszyki!$M$20:$M$89)","v":1},null,0,{"$error":"#N/A"},null,null,null,-4203,-4294,null,3,"2014-03-30",-1,null,null,null,null,null,"2023-10-29",{"$f":"AF10-1","v":"2023-10-28"},"2023-10-27","2023-10-26",null,{"$f":"NETWORKDAYS(AF10,AF10,koszyki!$M$20:$M$89)","v":0},{"$f":"NETWORKDAYS(AG10,AG10,koszyki!$M$20:$M$89)","v":0},{"$f":"NETWORKDAYS(AH10,AH10,koszyki!$M$20:$M$89)","v":1},{"$f":"NETWORKDAYS(AI10,AI10,koszyki!$M$20:$M$89)","v":1},null,0,0,1,2,null,2]
{"$rows_left_out":79}
{"sheet":"koszyki","index":1,"n_rows":89,"n_cols":26,"rows_kept":89,"cut":false,"hidden":true,"merged":[]}
["wprowadź datę",null,null,"koszyki roczne",null,null,null,"koszyki kwartalne",null,null,null,"koszyki miesięczne",null,null,null,"koszyki tygodniowe",null,null,null,"koszyki dzienne",null,null,null,"koszyki sezonowe"]
[{"$f":"'Kalkulator Depozytów'!F12","v":"00:00:00"},null,{"$f":"A2+2","v":"1900-01-02"},{"$f":"IF(F2<='raport RTT'!$F$9,DATE(YEAR(C2)+1,1,1),0)","v":"1901-01-01"},{"$f":"IF(D2=0,0,DATE(YEAR(D2)+1,1,1)-1)","v":"1901-12-31"},1,{"$f":"IF(OR(AND(MONTH(A2)=12,DAY(A2)=30),AND(MONTH(A2)=12,DAY(A2)=31)),MONTH(A2),MONTH(C2))","v":1},{"$f":"IF(J2<='raport RTT'!$F$7+1,IF(OR(G2=12,G2<10),DATE(YEAR(A2),G2+G4+1,1),IF(G2=10,DATE(YEAR(A2),G2+G4+1+1,1),DATE(YEAR(A2),G2+G4,1))),0)","v":"1900-04-01"},{"$f":"IF(H3=0,0,DATE(YEAR(H2),MONTH(H2)+3,1)-1)","v":"1900-06-30"},1,null,{"$f":"IF(N2<='raport RTT'!$F$6+1,DATE(YEAR(C2),MONTH(C2)+1,1),0)","v":"1900-02-01"},{"$f":"IF(L3=0,0,DATE(YEAR(L2),MONTH(L2)+1,1)-1)","v":60},1,{"$f":"DAY(A2)","v":0},{"$f":"IF(R2<='raport RTT'!F5,IF(OR(O3=5,O3=6,O3=7),A2+3*7-O3+1,A2+2*7-O3+1),0)","v":"1900-01-16"},{"$f":"IF(P3=0,0,P2+6)","v":"1900-01-22"},1,{"$f":"DAY(A2)","v":0},{"$f":"A2+1","v":"1900-01-01"},{"$f":"T2","v":"1900-01-01"},null,{"$f":"IF(OR(AND(MONTH(A2)=12,DAY(A2)=30),AND(MONTH(A2)=12,DAY(A2)=31)),MONTH(A2),MONTH(C2))","v":1},{"$f":"IF(Z2<='raport RTT'!$F$8,IF(W2<=3,DATE(YEAR(A2),10,1),IF(W2>=10,DATE(YEAR(A2)+1,10,1),DATE(YEAR(A2)+1,4,1))),0)","v":"1900-10-01"},{"$f":"IF(X3=0,0,DATE(YEAR(X2),MONTH(X2)+6,1)-1)","v":"1901-03-31"},1]
[{"$f":"A2+1","v":"1900-01-01"},null,null,{"$f":"IF(F3<='raport RTT'!$F$9,DATE(YEAR(D2)+1,1,1),0)","v":"1902-01-01"},{"$f":"IF(D3=0,0,DATE(YEAR(D3)+1,1,1)-1)","v":"1902-12-31"},2,{"$f":"MOD(G2,3)","v":1},{"$f":"IF(J3<='raport RTT'!$F$7+1,DATE(YEAR(H2),MONTH(H2)+3,1),0)","v":"1900-07-01"},{"$f":"IF(H4=0,0,DATE(YEAR(H3),MONTH(H3)+3,1)-1)","v":"1900-09-30"},2,null,{"$f":"IF(N3<='raport RTT'!$F$6+1,DATE(YEAR(L2),MONTH(L2)+1,1),0)","v":"1900-03-01"},{"$f":"IF(L4=0,0,DATE(YEAR(L3),MONTH(L3)+1,1)-1)","v":"1900-03-31"},2,{"$f":"WEEKDAY(A2)-1","v":6},{"$f":"IF($P$12=\"TAK\",IF(R3<'raport RTT'!$F$5,P2+7,0),IF(R3<='raport RTT'!$F$5,P2+7,0))","v":"1900-01-23"},{"$f":"IF(P4=0,0,P3+6)","v":"1900-01-29"},2,null,{"$f":"IF(T2+1<$P$2,IF(T2=0,0,T2+1),0)","v":"1900-01-02"},{"$f":"T3","v":"1900-01-02"},null,{"$f":"MOD(W2,6)","v":1},{"$f":"IF(Z3<='raport RTT'!$F$8,DATE(YEAR(X2),MONTH(X2)+6,1),0)","v":"1901-04-01"},{"$f":"IF(X4=0,0,DATE(YEAR(X3),MONTH(X3)+6,1)-1)","v":"1901-09-30"},2]
["Typ kontraktu",null,null,{"$f":"IF(F4<='raport RTT'!$F$9,DATE(YEAR(D3)+1,1,1),0)","v":"00:00:00"},"00:00:00",3,{"$f":"IF(AND(G2<9,G3<>0),3-G3,G3)","v":2},{"$f":"IF(J4<='raport RTT'!$F$7+1,DATE(YEAR(H3),MONTH(H3)+3,1),0)","v":"1900-10-01"},"1900-12-31",3,null,{"$f":"IF(N4<='raport RTT'!$F$6+1,DATE(YEAR(L3),MONTH(L3)+1,1),0)","v":"1900-04-01"},"1900-04-30",3,{"$f":"7-O3","v":1},{"$f":"IF($P$12=\"TAK\",IF(R4<'raport RTT'!$F$5,P3+7,0),IF(R4<='raport RTT'!$F$5,P3+7,0))","v":"1900-01-30"},"1900-02-05",3,"ile wziąć?",{"$f":"IF(T3+1<$P$2,IF(T3=0,0,T3+1),0)","v":"1900-01-03"},"1900-01-03",null,{"$f":"IF(AND(W2<9,W3<>0),6-W3,W3)","v":5},{"$f":"IF(Z4<='raport RTT'!$F$8,DATE(YEAR(X3),MONTH(X3)+6,1),0)","v":"1901-10-01"},"00:00:00",3]
["GAS_BASE",24,null,{"$f":"IF(F5<='raport RTT'!$F$9,DATE(YEAR(D4)+1,1,1),0)","v":"00:00:00"},{"$f":"IF(D5=0,0,DATE(YEAR(D5)+1,1,1)-1)","v":"00:00:00"},4,{"$f":"DATE(YEAR(H5),MONTH(H5)+3,1)-A2","v":457},{"$f":"IF(J5<='raport RTT'!$F$7+1,DATE(YEAR(H4),MONTH(H4)+3,1),0)","v":"1901-01-01"},"1901-03-31",4,null,{"$f":"IF(N5<='raport RTT'!$F$6+1,DATE(YEAR(L4),MONTH(L4)+1,1),0)","v":"1900-05-01"},"00:00:00",4,null,{"$f":"IF($P$12=\"TAK\",IF(R5<'raport RTT'!$F$5,P4+7,0),IF(R5<='raport RTT'!$F$5,P4+7,0))","v":"1900-02-06"},"00:00:00",4,{"$f":"17-COUNTIF(T2:T17,\"<>0\")","v":2},{"$f":"IF(T4+1<$P$2,IF(T4=0,0,T4+1),0)","v":"1900-01-04"},"1900-01-04",null,null,{"$f":"IF(Z5<='raport RTT'!$F$8,DATE(YEAR(X4),MONTH(X4)+6,1),0)","v":"00:00:00"},"00:00:00",4]
[null,null,null,{"$f":"IF(F6<='raport RTT'!$F$9,DATE(YEAR(D5)+1,1,1),0)","v":"00:00:00"},"00:00:00",5,null,{"$f":"IF(J6<='raport RTT'!$F$7+1,DATE(YEAR(H5),MONTH(H5)+3,1),0)","v":"1901-04-01"},{"$f":"IF(H7=0,0,DATE(YEAR(H6),MONTH(H6)+3,1)-1)","v":"00:00:00"},5,null,{"$f":"IF(N6<='raport RTT'!$F$6+1,DATE(YEAR(L5),MONTH(L5)+1,1),0)","v":"00:00:00"},"00:00:00",5,"zapas!",{"$f":"IF($P$12=\"TAK\",IF(R6<'raport RTT'!$F$5,P5+7,0),IF(R6<='raport RTT'!$F$5,P5+7,0))","v":"00:00:00"},"00:00:00",5,{"$f":"COUNTIF(T2:T17,\"<>0\")","v":15},"1900-01-05","1900-01-05",null,null,{"$f":"IF(Z6<='raport RTT'!$F$8,DATE(YEAR(X5),MONTH(X5)+6,1),0)","v":"00:00:00"},"00:00:00",5]
[null,null,null,null,null,null,null,{"$f":"IF(J7<='raport RTT'!$F$7+1,DATE(YEAR(H6),MONTH(H6)+3,1),0)","v":"00:00:00"},{"$f":"IF(H8=0,0,DATE(YEAR(H7),MONTH(H7)+3,1)-1)","v":"00:00:00"},6,null,{"$f":"IF(N7<='raport RTT'!$F$6+1,DATE(YEAR(L6),MONTH(L6)+1,1),0)","v":"00:00:00"},"00:00:00",6,null,{"$f":"IF($P$12=\"TAK\",IF(R7<'raport RTT'!$F$5,P6+7,0),IF(R7<='raport RTT'!$F$5,P6+7,0))","v":"00:00:00"},"00:00:00",6,null,"1900-01-06","1900-01-06"]
[null,null,null,"do dodania końców",null,null,null,{"$f":"IF(J8<='raport RTT'!$F$7+1,DATE(YEAR(H7),MONTH(H7)+3,1),0)","v":"00:00:00"},{"$f":"IF(H9=0,0,DATE(YEAR(H8),MONTH(H8)+3,1)-1)","v":"00:00:00"},7,null,{"$f":"IF(N8<='raport RTT'!$F$6+1,DATE(YEAR(L7),MONTH(L7)+1,1),0)","v":"00:00:00"},"00:00:00",7,null,null,null,null,null,"1900-01-07","1900-01-07"]
[null,null,null,{"$f":"DATE(YEAR(A3),MONTH(A3)+1,1)-1","v":"1900-01-31"},null,null,null,null,null,null,null,{"$f":"IF(N9<='raport RTT'!$F$6+1,DATE(YEAR(L8),MONTH(L8)+1,1),0)","v":"00:00:00"},"00:00:00",8,null,null,null,null,null,"1900-01-08","1900-01-08"]
[null,null,null,{"$f":"DATE(YEAR(A3),MONTH(A3)+2,1)-1","v":60},null,null,null,null,null,null,null,{"$f":"IF(N10<='raport RTT'!$F$6+1,DATE(YEAR(L9),MONTH(L9)+1,1),0)","v":"00:00:00"},"00:00:00",9,null,{"$f":"IF(WEEKDAY(A2+28,2)=5,\"TAK\",\"NIE\")","v":"NIE"},null,null,null,"1900-01-09","1900-01-09"]
{"$rows_left_out":80}
{"sheet":"raport RTT","index":2,"n_rows":20,"n_cols":9,"rows_kept":20,"cut":false,"hidden":true,"merged":[]}
[]
[]
[]
[]
[null,"GAS_BASE_W-41-21",{"$f":"IFERROR(MID(B5,FIND(\"_\",B5)+6,1),\"\")","v":"W"},null,"W",{"$f":"COUNTIF(C:C,E5)","v":4},null,null,"tutaj usuwając/dodając instrumenty wpływamy na ilość generujących się koszyków"]
[null,"GAS_BASE_W-42-21","W",null,"M",{"$f":"COUNTIF(C:C,E6)","v":3}]
[null,"GAS_BASE_W-43-21","W",null,"Q",4]
[null,"GAS_BASE_W-44-21","W",null,"S",3]
[null,"GAS_BASE_M-11-21","M",null,"Y",{"$f":"COUNTIF(C:C,E9)","v":2}]
[null,"GAS_BASE_M-12-21","M"]
{"$rows_left_out":11}
{"sheet":"Arkusz2","index":3,"n_rows":23,"n_cols":6,"rows_kept":23,"cut":false,"hidden":true,"merged":[]}
["2023-10-27","2023-10-27",null,null,null,"liczba koszyków"]
["2023-10-28","2023-10-28",null,null,null,{"$f":"COUNTA(A:A)","v":23}]
["2023-10-29","2023-10-29"]
["2023-10-30","2023-10-30"]
["2023-10-31","2023-10-31"]
["2023-11-01","2023-11-01"]
["2023-11-02","2023-11-02"]
["2023-11-03","2023-11-03"]
["2023-11-04","2023-11-04"]
["2023-11-05","2023-11-05"]
{"$rows_left_out":14}
{"sheet":"krzywa","index":4,"n_rows":2208,"n_cols":3,"rows_kept":2208,"cut":false,"hidden":true,"merged":[]}
[null,"PEAK","BASE"]
["days to delivery ","initial margin","initial margin"]
[1,null,0.21779999999999999]
[2,null,0.217]
[3,null,0.21609999999999999]
[4,null,0.21529999999999999]
[5,null,0.21440000000000001]
[6,null,0.21360000000000001]
[7,null,0.2127]
[8,null,0.21190000000000001]
{"$rows_left_out":2199}
{"sheet":"Instrukcja","index":5,"n_rows":26,"n_cols":2,"rows_kept":26,"cut":false,"hidden":false,"merged":[[10,1,11,13],[13,1,15,13],[16,1,17,13],[18,1,22,13],[25,1,25,13],[9,1,9,13],[1,1,1,13],[3,1,4,13],[5,1,5,13],[7,1,7,13],[8,1,8,13]]}
[]
[null,"Instrukcja obsługi kalkulatora depozytów dla portfeli dla Rynku Terminowego Produktów Gazowych"]
[]
[null,"Kalkulator depozytów służy do wyliczania depozytu wstępnego i uzupełniającego na Rynku Terminowym Produktów Gazowych dla dowolnych portfeli kontraktów."]
[]
[null,"Przed rozpoczęciem pracy z kalkulatorem należy upewnić się, że obsługa makr w MS Excel jest włączona."]
[]
[null,"W celu obliczenia depozytów należy:"]
[null,"1. Podać datę naliczenia depozytów zabezpieczających (w formacie rrrr-mm-dd)."]
[null,"2. Stworzyć zestawienie koszyków dostaw na rynku RTPG poprzez wciśnięcie przycisku \"Stwórz koszyki dostaw\"."]
{"$rows_left_out":17}
{"sheet":"Manual","index":6,"n_rows":26,"n_cols":2,"rows_kept":26,"cut":false,"hidden":false,"merged":[[25,1,25,13],[1,1,1,13],[3,1,4,13],[5,1,5,13],[7,1,7,13],[8,1,8,13],[9,1,9,13],[10,1,11,13],[13,1,15,13],[16,1,17,13],[18,1,21,13],[22,1,22,13]]}
[]
[null,"Manual for portfolio margin calculator for RTPG"]
[]
[null,"The margin calculator is designed for calculation of the initial margin value and the variation margin value on the Commodity Exchange Markets for any contract portfolio."]
[]
[null,"Before starting work with margin calculator you should make sure that MS Excel macro handling has been enabled."]
[]
[null,"In order to calculate the margins you should:"]
[null,"1. Enter the date of reckoning the collateral margins (in yyyy-mm-dd format)."]
[null,"2. Create statement of the delivery baskets for the Commodity Exchange Markets through pressing \"Create delivery baskets\" button."]
{"$rows_left_out":17}
{"sheet":"Kalkulator Depozytów","index":7,"n_rows":62,"n_cols":27,"rows_kept":62,"cut":false,"hidden":false,"merged":[[32,2,32,5],[2,1,6,6],[23,2,23,5],[3,11,4,11],[7,1,7,6]]}
[]
[null,null,null,null,null,null,null,null,null,null,null,null,null,null,null,null,null,null,null,null,null,null,null,null,null,null,1]
[null,"Kalkulator depozytów na RTTG",null,null,null,null,null,null,null,null,"GAS_BASE","Depozyt ogółem",null,null,null,null,null,null,null,null,null,null,null,null,null,"GAS_BASE",0.5]
[null,null,null,null,null,null,null,null,null,"Dep. Wstępny",0,0,null,null,null,null,null,null,null,null,null,null,null,null,null,null,0.27500000000000002]
[null,null,null,null,null,null,null,null,null,"Dep. Uzupełniający",0,null,null,"-"]
[]
[]
[]
[]
[null,null,null,null,null,"GAS_BASE",null,null,null,null,null,null,390,30670.049999999996,360,28285.049999999996]
{"$rows_left_out":53}
{"sheet":"Transakcje_PCCP","index":8,"n_rows":0,"n_cols":0,"rows_kept":0,"cut":false,"hidden":false,"merged":[]}

{"sheet":"Tabela","index":9,"n_rows":1034,"n_cols":57,"rows_kept":1034,"cut":false,"hidden":true,"merged":[]}
[]
[]
[]
[]
[null,null,null,null,null,null,null,null,null,null,null,null,null,null,null,null,null,null,null,null,null,null,null,null,null,null,null,null,null,null,null,null,null,null,null,null,null,null,null,null,null,"42 kupno","43 sprzedaz","44 start",null,"46 roznica",null,"48 kurs kupna","49 kurs sprzedazy"]
[]
[]
[null,null,null,null,null,null,null,null,null,null,null,null,null,null,null,null,null,null,null,null,null,null,null,null,null,null,null,null,null,null,null,null,null,null,null,null,null,null,"cos1","cos2","cos3","cos4","cos5","cos6","cos7","cos8","cos9","cos10","cos11","cos12"]
[null,null,null,null,null,null,null,null,null,null,null,null,null,null,null,null,null,null,null,null,null,null,null,null,null,null,null,null,null,null,null,null,null,null,null,null,null,null,null,null,null,null,null,null,null,null,null,null,null,1,null,null,20131,1,2013,"2012-12-31","2013-01-06"]
[null,null,null,null,null,null,null,null,null,null,null,null,null,null,null,null,null,null,null,null,null,null,null,null,null,null,null,null,null,null,null,null,null,null,null,null,null,null,null,null,null,null,null,null,null,null,null,null,null,2,null,null,20132,2,2013,"2013-01-07","2013-01-13"]
{"$rows_left_out":1024}